Nb16 radical anion

Gas phase ion energetics data

Data compiled by: John E. Bartmess

Electron affinity of neutral species

EAneutral (eV) Method Reference Comment
1.620 ± 0.050LPESKietzmann, Morenzin, et al., 1998Stated electron affinity is the Vertical Detachment Energy

References

Kietzmann, Morenzin, et al., 1998
Kietzmann, H.; Morenzin, J.; Bechthold, P.S.; Ganteför, G.; Eberhardt, W., Photoelectron spectra of Nb-n(-) clusters: Correlation between electronic structure and hydrogen chemisorption, J. Chem. Phys., 1998, 109, 6, 2275-2278, https://doi.org/10.1063/1.476853 . [all data]