Nb13 radical anion

Gas phase ion energetics data

Data compiled by: John E. Bartmess

Electron affinity of neutral species

EAneutral (eV) Method Reference Comment
1.270 ± 0.050LPESPramann, Koyasu, et al., 2003Vertical Detachment Energy: 1.74±0.05 eV
1.698 ± 0.050LPESKietzmann, Morenzin, et al., 1998Stated electron affinity is the Vertical Detachment Energy

References

Pramann, Koyasu, et al., 2003
Pramann, A.; Koyasu, K.; Nakajima, A.; Kaya, K., Band gap shiftings in Co-doped Nb-n (n=3-15) clusters: influence of Co 3d electrons on the electronic structure, Int. J. Mass Spectrom., 2003, 229, 1-2, 77-82, https://doi.org/10.1016/S1387-3806(03)00258-6 . [all data]

Kietzmann, Morenzin, et al., 1998
Kietzmann, H.; Morenzin, J.; Bechthold, P.S.; Ganteför, G.; Eberhardt, W., Photoelectron spectra of Nb-n(-) clusters: Correlation between electronic structure and hydrogen chemisorption, J. Chem. Phys., 1998, 109, 6, 2275-2278, https://doi.org/10.1063/1.476853 . [all data]