piPr-benzoate anion

Reaction thermochemistry data

Data compiled by: John E. Bartmess

Individual Reactions

C10H11O2- + Hydrogen cation = Benzoic acid, 4-(1-methylethyl)-

By formula: C10H11O2- + H+ = C10H12O2

Quantity Value Units Method Reference Comment
Δr1423. ± 9.2kJ/molG+TSFiedler, Kulhanek, et al., 1999gas phase
Quantity Value Units Method Reference Comment
Δr1394. ± 8.4kJ/molIMREFiedler, Kulhanek, et al., 1999gas phase

References

Fiedler, Kulhanek, et al., 1999
Fiedler, P.; Kulhanek, J.; Decouzon, M.; Gal, J.F.; Maria, P.C.; Exner, O., Steric effects and steric inhibition of resonance in isopropylbenzoic acids in the gas phase and in solution, Coll. Czech. Chem. Commun., 1999, 64, 9, 1433-1447, https://doi.org/10.1135/cccc19991433 . [all data]