Al3O2 radical anion

Gas phase ion energetics data

Data compiled by: John E. Bartmess

Electron affinity of neutral species

EAneutral (eV) Method Reference Comment
1.62 ± 0.12LPESMeloni, Ferguson, et al., 2003
2.180 ± 0.060LPESWu, Li, et al., 1998Vertical Detachment Energy: 2.29±0.06 eV. Isomer with EA=1.6 eV

References

Meloni, Ferguson, et al., 2003
Meloni, G.; Ferguson, M.J.; Neumark, D.M., Negative ion photodetachment spectroscopy of the Al3O2, Al3O3, Al4Ox, Al5Ox, (x=3-5), Al6O5, and Al7O5 clusters, Phys. Chem. Chem. Phys., 2003, 5, 19, 4073-4079, https://doi.org/10.1039/b308119b . [all data]

Wu, Li, et al., 1998
Wu, H.; Li, X.; Wang, X.-B.; Ding, C.-F.; Wang, L.-S., Al3Oy (y=0-5) Clusters: Sequential Oxidation, Metal-to-oxide Transformation, and Photoisomerization., J. Chem. Phys., 1998, 109, 2, 449, https://doi.org/10.1063/1.476583 . [all data]