B2N anion

Gas phase ion energetics data

Data compiled by: John E. Bartmess

Electron affinity of neutral species

EAneutral (eV) Method Reference Comment
3.0980 ± 0.0050LPESAsmis, Taylor, et al., 1999

References

Asmis, Taylor, et al., 1999
Asmis, K.R.; Taylor, T.R.; Neumark, D.M., Anion photoelectron spectroscopy of B2N-, J. Chem. Phys., 1999, 111, 19, 8838-8851, https://doi.org/10.1063/1.480230 . [all data]