(H2O)3..thymine radical anion

Gas phase ion energetics data

Data compiled by: John E. Bartmess

Electron affinity of neutral species

EAneutral (eV) Method Reference Comment
0.82 ± 0.10LPESSchiedt, Weinkauf, et al., 1998

References

Schiedt, Weinkauf, et al., 1998
Schiedt, J.; Weinkauf, R.; Neumark, D.M.; Schlag, E.W., Anion spectroscopy of uracil, thymine and the amino-oxo and amino-hydroxy tautomers of cytosine and their water clusters, Chem. Phys., 1998, 239, 1-3, 511-524, https://doi.org/10.1016/S0301-0104(98)00361-9 . [all data]