(H2O)5..uracil radical anion

Gas phase ion energetics data

Data compiled by: John E. Bartmess

Electron affinity of neutral species

EAneutral (eV) Method Reference Comment
1.2600 ± 0.0043LPESEustis, Wang, et al., 2007EA is threshhold energy. Vertical Detachment Energy: 1.88±0.05 eV
1.40 ± 0.10LPESSchiedt, Weinkauf, et al., 1998

References

Eustis, Wang, et al., 2007
Eustis, S.; Wang, D.; Lyapustina, S.; Bowen, K.H., Photoelectron spectroscopy of hydrated adenine anions, J. Chem. Phys., 2007, 127, 22, 224309, https://doi.org/10.1063/1.2806033 . [all data]

Schiedt, Weinkauf, et al., 1998
Schiedt, J.; Weinkauf, R.; Neumark, D.M.; Schlag, E.W., Anion spectroscopy of uracil, thymine and the amino-oxo and amino-hydroxy tautomers of cytosine and their water clusters, Chem. Phys., 1998, 239, 1-3, 511-524, https://doi.org/10.1016/S0301-0104(98)00361-9 . [all data]