W50 radical anion

Gas phase ion energetics data

Data compiled by: John E. Bartmess

Electron affinity of neutral species

EAneutral (eV) Method Reference Comment
3.03 ± 0.27LPESLee, Huh, et al., 1999

References

Lee, Huh, et al., 1999
Lee, G.H.; Huh, S.H.; Park, Y.C.; Hayakawa, F.; Negishi, Y.; Nakajima, A.; Kaya, K., Photoelectron spectra of small nanophase W metal cluster anions, Chem. Phys. Lett., 1999, 299, 3-4, 309-314, https://doi.org/10.1016/S0009-2614(98)01291-3 . [all data]