Diphenylethyne anion

Gas phase thermochemistry data

Data compiled by: John E. Bartmess

Quantity Value Units Method Reference Comment
Δfgas>372. ± 7.5kJ/molR-EAWojnarovits and Foldiak, 1981G3MP2B3 calculations indicate an EA of ca. 0.2 eV

References

Wojnarovits and Foldiak, 1981
Wojnarovits, L.; Foldiak, G., Electron capture detection of aromatic hydrocarbons, J. Chromatogr. Sci., 1981, 206, 511. [all data]