C60Na7 radical anion

Gas phase ion energetics data

Data compiled by: John E. Bartmess

Electron affinity of neutral species

EAneutral (eV) Method Reference Comment
1.390 ± 0.050LPESPalpant, Otake, et al., 1999Vertical Detachment Energy: 2.09 eV. See Palpant, Negishi, et al., 2001 for 5.81 eV LPES

References

Palpant, Otake, et al., 1999
Palpant, B.; Otake, A.; Hayakawa, F.; Negishi, Y.; Lee, G.H.; Nakajima, A.; Kaya, K., Photoelectron spectroscopy of sodium-coated C-60 and C-70 cluster anions, Phys. Rev. B: Cond. Matt., 1999, 60, 7, 4509-4512, https://doi.org/10.1103/PhysRevB.60.4509 . [all data]

Palpant, Negishi, et al., 2001
Palpant, B.; Negishi, Y.; Sanekata, M.; Miyajima, K.; Nagao, S.; Judai, K.; Rayner, D.M.; Simard, B.; Hackett, P.A.; Nakajima, A.; Kaya, K., Electronic and geometric properties of exohedral sodium- and gold-fullerenes, J. Chem. Phys., 2001, 114, 19, 8459-8466, https://doi.org/10.1063/1.1366641 . [all data]