PhCHI anion

Reaction thermochemistry data

Data compiled by: John E. Bartmess

Individual Reactions

C7H6I- + Hydrogen cation = Benzene, (iodomethyl)-

By formula: C7H6I- + H+ = C7H7I

Quantity Value Units Method Reference Comment
Δr1556. ± 8.8kJ/molG+TSPoutsma, Nash, et al., 1997gas phase; between tBuCH(Me)OH, FCH2CH2OH
Quantity Value Units Method Reference Comment
Δr1525. ± 8.4kJ/molIMRBPoutsma, Nash, et al., 1997gas phase; between tBuCH(Me)OH, FCH2CH2OH

Gas phase ion energetics data

Data compiled by: John E. Bartmess

Protonation reactions

C7H6I- + Hydrogen cation = Benzene, (iodomethyl)-

By formula: C7H6I- + H+ = C7H7I

Quantity Value Units Method Reference Comment
Δr1556. ± 8.8kJ/molG+TSPoutsma, Nash, et al., 1997gas phase; between tBuCH(Me)OH, FCH2CH2OH
Quantity Value Units Method Reference Comment
Δr1525. ± 8.4kJ/molIMRBPoutsma, Nash, et al., 1997gas phase; between tBuCH(Me)OH, FCH2CH2OH

References

Poutsma, Nash, et al., 1997
Poutsma, J.C.; Nash, J.J.; Paulino, J.A.; Squires, R.R., Absolute Heats of Formation of Phenylcarbene and Vinylcarbene, J. Am. Chem. Soc., 1997, 119, 20, 4686, https://doi.org/10.1021/ja963918s . [all data]