PdCN anion

Gas phase ion energetics data

Data compiled by: John E. Bartmess

Electron affinity of neutral species

EAneutral (eV) Method Reference Comment
2.5430 ± 0.0070LPESKlopcic, Moravec, et al., 1999detachment from a non-bonding orbital on Pd

References

Klopcic, Moravec, et al., 1999
Klopcic, S.A.; Moravec, V.D.; Jarrold, C.C., Anion photoelectron spectroscopy of PdCO- and PdCN: Reactivity of Pd-, J. Chem. Phys., 1999, 110, 18, 8986-8991, https://doi.org/10.1063/1.478817 . [all data]