BH2 anion

Reaction thermochemistry data

Data compiled by: John E. Bartmess

Individual Reactions

H2B- + Hydrogen cation = Borane

By formula: H2B- + H+ = H3B

Quantity Value Units Method Reference Comment
Δr411.80kcal/molN/ABartmess and Hinde, 2005gas phase

Gas phase ion energetics data

Data compiled by: John E. Bartmess

Electron affinity of neutral species

EAneutral (eV) Method Reference Comment
0.38724D-EABartmess and Hinde, 2005

Protonation reactions

H2B- + Hydrogen cation = Borane

By formula: H2B- + H+ = H3B

Quantity Value Units Method Reference Comment
Δr411.80kcal/molN/ABartmess and Hinde, 2005gas phase

References

Bartmess and Hinde, 2005
Bartmess, J.E.; Hinde, R.J., The Gas Phase Acidities of the Elemental Hydrides are Functions of Bond Lengths and Electronegativity, Can. J. Chem., 2005, 83, 11, 2005-2012, https://doi.org/10.1139/v05-218 . [all data]