Al2O2 anion

Gas phase ion energetics data

Data compiled by: John E. Bartmess

Electron affinity of neutral species

EAneutral (eV) Method Reference Comment
1.880 ± 0.030LPESDesai, Wu, et al., 1997Calculations ( Archibong and St-Amant, 1999) agree.

References

Desai, Wu, et al., 1997
Desai, S.R.; Wu, H.; Rohlfing, C.M.; Wang, L.-S., A Study of the Structure and Bonding of Small Aluminum Oxide Clusters by Photoelectron Spectroscopy: AlxOy- (x=1-2, y=1-5), J. Chem. Phys., 1997, 106, 4, 1309, https://doi.org/10.1063/1.474085 . [all data]

Archibong and St-Amant, 1999
Archibong, E.F.; St-Amant, A., On the structure of Al2O3 and photoelectron spectra of Al2O2- and Al2O3-, J. Phys. Chem. A, 1999, 103, 8, 1109-1114, https://doi.org/10.1021/jp983695n . [all data]