(Xe)10..I anion

Reaction thermochemistry data

Data compiled by: John E. Bartmess

Individual Reactions

IXe9- + 10Xenon = IXe10-

By formula: IXe9- + 10Xe = IXe10-

Quantity Value Units Method Reference Comment
Δr5.0 ± 3.8kJ/molN/ABecker, Markovich, et al., 1997gas phase; Stated electron affinity is the Vertical Detachment Energy

IXe10- + 11Xenon = IXe11-

By formula: IXe10- + 11Xe = IXe11-

Quantity Value Units Method Reference Comment
Δr3.8 ± 3.8kJ/molN/ABecker, Markovich, et al., 1997gas phase; Stated electron affinity is the Vertical Detachment Energy

Gas phase ion energetics data

Data compiled by: John E. Bartmess

Electron affinity of neutral species

EAneutral (eV) Method Reference Comment
3.5950 ± 0.0080LPESPivonka, Lenzer, et al., 2001Vertical Detachment Energy:3.616±0.008 eV
3.650 ± 0.020LPESBecker, Markovich, et al., 1997Stated electron affinity is the Vertical Detachment Energy

Ion clustering data

Data compiled by: John E. Bartmess

Clustering reactions

IXe9- + 10Xenon = IXe10-

By formula: IXe9- + 10Xe = IXe10-

Quantity Value Units Method Reference Comment
Δr1.20 ± 0.90kcal/molN/ABecker, Markovich, et al., 1997gas phase; Stated electron affinity is the Vertical Detachment Energy

IXe10- + 11Xenon = IXe11-

By formula: IXe10- + 11Xe = IXe11-

Quantity Value Units Method Reference Comment
Δr0.90 ± 0.90kcal/molN/ABecker, Markovich, et al., 1997gas phase; Stated electron affinity is the Vertical Detachment Energy

References

Becker, Markovich, et al., 1997
Becker, I.; Markovich, G.; Chesnovsky, O., Bound Delocalized Excited States in I-Xen Clusters., Phys. Rev. Lett., 1997, 79, 18, 3391, https://doi.org/10.1103/PhysRevLett.79.3391 . [all data]