(Xe)9..I anion

Reaction thermochemistry data

Data compiled by: John E. Bartmess

Individual Reactions

IXe9- + 10Xenon = IXe10-

By formula: IXe9- + 10Xe = IXe10-

Quantity Value Units Method Reference Comment
Δr5.0 ± 3.8kJ/molN/ABecker, Markovich, et al., 1997gas phase; Stated electron affinity is the Vertical Detachment Energy

IXe8- + 9Xenon = IXe9-

By formula: IXe8- + 9Xe = IXe9-

Quantity Value Units Method Reference Comment
Δr3.8 ± 3.8kJ/molN/ABecker, Markovich, et al., 1997gas phase; Stated electron affinity is the Vertical Detachment Energy

Gas phase ion energetics data

Data compiled by: John E. Bartmess

Electron affinity of neutral species

EAneutral (eV) Method Reference Comment
3.5540 ± 0.0080LPESPivonka, Lenzer, et al., 2001Vertical Detachment Energy:3.581±0.008 eV
3.600 ± 0.020LPESBecker, Markovich, et al., 1997Stated electron affinity is the Vertical Detachment Energy

Ion clustering data

Data compiled by: John E. Bartmess

Clustering reactions

IXe8- + 9Xenon = IXe9-

By formula: IXe8- + 9Xe = IXe9-

Quantity Value Units Method Reference Comment
Δr3.8 ± 3.8kJ/molN/ABecker, Markovich, et al., 1997gas phase; Stated electron affinity is the Vertical Detachment Energy

IXe9- + 10Xenon = IXe10-

By formula: IXe9- + 10Xe = IXe10-

Quantity Value Units Method Reference Comment
Δr5.0 ± 3.8kJ/molN/ABecker, Markovich, et al., 1997gas phase; Stated electron affinity is the Vertical Detachment Energy

References

Becker, Markovich, et al., 1997
Becker, I.; Markovich, G.; Chesnovsky, O., Bound Delocalized Excited States in I-Xen Clusters., Phys. Rev. Lett., 1997, 79, 18, 3391, https://doi.org/10.1103/PhysRevLett.79.3391 . [all data]

Pivonka, Lenzer, et al., 2001
Pivonka, N.L.; Lenzer, T.; Furlanetto, M.R.; Neumark, D.M., Photoelectron spectroscopy of XenI- clusters (n = 13), Chem. Phys., 2001, 334, 24-30. [all data]