(Xe)3..I anion

Gas phase ion energetics data

Data compiled by: John E. Bartmess

Electron affinity of neutral species

EAneutral (eV) Method Reference Comment
3.290 ± 0.020LPESBecker, Markovich, et al., 1997Stated electron affinity is the Vertical Detachment Energy

References

Becker, Markovich, et al., 1997
Becker, I.; Markovich, G.; Chesnovsky, O., Bound Delocalized Excited States in I-Xen Clusters., Phys. Rev. Lett., 1997, 79, 18, 3391, https://doi.org/10.1103/PhysRevLett.79.3391 . [all data]