As4 anion

Gas phase ion energetics data

Data compiled by: John E. Bartmess

Electron affinity of neutral species

EAneutral (eV) Method Reference Comment
<0.799982LPESLippa, Xu, et al., 1998Vertical Detachment Energy: 1.52 eV

References

Lippa, Xu, et al., 1998
Lippa, T.P.; Xu, S.J.; Lyapustina, S.A.; Nilles, J.M.; Bowen, K.H., Photoelectron spectroscopy of As-, As-2(-), As-3(-), As-4(-), and As-5(-), J. Chem. Phys., 1998, 109, 24, 10727-10731, https://doi.org/10.1063/1.477771 . [all data]