ClONO2..NO3 anion

Reaction thermochemistry data

Data compiled by: John E. Bartmess

Individual Reactions

NO3 anion + Chlorine nitrate = ClN2O6-

By formula: NO3- + ClNO3 = ClN2O6-

Quantity Value Units Method Reference Comment
Δr85. ± 24.kJ/molIMRBWincel, Mereand, et al., 1997gas phase

Ion clustering data

Data compiled by: John E. Bartmess

Clustering reactions

NO3 anion + Chlorine nitrate = ClN2O6-

By formula: NO3- + ClNO3 = ClN2O6-

Quantity Value Units Method Reference Comment
Δr85. ± 24.kJ/molIMRBWincel, Mereand, et al., 1997gas phase

References

Wincel, Mereand, et al., 1997
Wincel, H.; Mereand, E.; Castleman, A.W., Gas-phase reactions of ClONO2 with Cl-(D2O)(n=0-3) and NO2-, J. Phys. Chem. A, 1997, 101, 44, 8248-8254, https://doi.org/10.1021/jp9701146 . [all data]