(MeOH)4..I anion

Gas phase thermochemistry data

Data compiled by: John E. Bartmess

Quantity Value Units Method Reference Comment
Δfgas-275.4 ± 1.6kcal/molTherHiraoka and Yamabe, 1991

References

Hiraoka and Yamabe, 1991
Hiraoka, K.; Yamabe, S., Solvation of Halide Ions with CH3OH in the gas Phase, Int. J. Mass Spectrom. Ion Proc., 1991, 109, 133, https://doi.org/10.1016/0168-1176(91)85101-Q . [all data]