1-Chloronaphthalene anion

Gas phase thermochemistry data

Data compiled by: John E. Bartmess

Quantity Value Units Method Reference Comment
Δfgas22.2 ± 2.3kcal/molR-EASteelhammer and Wentworth, 1969

References

Steelhammer and Wentworth, 1969
Steelhammer, J.C.; Wentworth, W.E., Correlation of Electron Beam and Thermal Electron Attachment Studies for Some Chloro, Bromo, Iodo Aromatic Compounds, J. Chem. Phys., 1969, 51, 5, 1802, https://doi.org/10.1063/1.1672262 . [all data]