pCl-C6F4N(C6F5) anion

Gas phase ion energetics data

Data compiled by: John E. Bartmess

Protonation reactions

C12ClF9N- + Hydrogen cation = C12HClF9N

By formula: C12ClF9N- + H+ = C12HClF9N

Quantity Value Units Method Reference Comment
Δr1318. ± 8.4kJ/molIMREKoppel, Koppel, et al., 1998gas phase

Reaction thermochemistry data

Data compiled by: John E. Bartmess

Individual Reactions

C12ClF9N- + Hydrogen cation = C12HClF9N

By formula: C12ClF9N- + H+ = C12HClF9N

Quantity Value Units Method Reference Comment
Δr314.9 ± 2.0kcal/molIMREKoppel, Koppel, et al., 1998gas phase

References

Koppel, Koppel, et al., 1998
Koppel, I.; Koppel, J.; Maria, P.C.; Gal, J.F.; Notario, R.; Vlasov, V.M.; Taft, R.W., Comparison of Bronsted acidities of neutral NH-acids in gas phase, dimethyl sulfoxide and water, Int. J. Mass Spectrom., 1998, 175, 1-2, 61-69, https://doi.org/10.1016/S0168-1176(98)00113-X . [all data]