iridium anion

Gas phase thermochemistry data

Data compiled by: John E. Bartmess

Quantity Value Units Method Reference Comment
Δfgas122.93 ± 0.50kcal/molR-EABilodeau, Scheer, et al., 1999

References

Bilodeau, Scheer, et al., 1999
Bilodeau, R.C.; Scheer, M.; Haugen, H.K.; Brooks, R.L., Near-threshold Laser Spectroscopy of Iridium and Platinum Negative Ions: Electron Affinities and the Threshold Law, Phys. Rev. A, 1999, 61, 1, 12505, https://doi.org/10.1103/PhysRevA.61.012505 . [all data]