H2O..O2C(CH2)2CO2 dianion

Reaction thermochemistry data

Data compiled by: John E. Bartmess

Individual Reactions

Butanedioic acid, ion(2-) + Water = C4H6O5-2

By formula: Butanedioic acid, ion(2-) + H2O = C4H6O5-2

Quantity Value Units Method Reference Comment
Δr34. ± 18.kJ/molN/ADing, Wang, et al., 1998gas phase; Affinity is EA difference from next lower solvated ion.

References

Ding, Wang, et al., 1998
Ding, C.F.; Wang, X.B.; Wang, L.S., Photoelectron spectroscopy of doubly charged anions: Intramolecular Coulomb repulsion and solvent stabilization, J. Phys. Chem. A, 1998, 102, 45, 8633-8636, https://doi.org/10.1021/jp982698x . [all data]