Pb55 anion

Gas phase ion energetics data

Data compiled by: John E. Bartmess

Electron affinity of neutral species

EAneutral (eV) Method Reference Comment
2.750 ± 0.080LPESNegishi, Kawamata, et al., 2000EA is threshold energy, upper limit to true EA
2.97 ± 0.22LPESLuder and MeiwesBroer, 1998EA given is Vertical Detachment Energy (set as 10% of max)

References

Negishi, Kawamata, et al., 2000
Negishi, Y.; Kawamata, H.; Nakajima, A.; Kaya, K., Photoelectron spectroscopy of tin and lead cluster anions: application of halogen-doping method, J. Electron Spectros. Rel. Phenom., 2000, 106, 2-3, 117-125, https://doi.org/10.1016/S0368-2048(99)00070-5 . [all data]

Luder and MeiwesBroer, 1998
Luder, C.; MeiwesBroer, K.H., Electron detachment energies of Pb-N(-) (N = 24-204) determined in a simple magnetic bottle photoelectron spectrometer, Chem. Phys. Lett., 1998, 294, 4-5, 391-396, https://doi.org/10.1016/S0009-2614(98)00895-1 . [all data]