Pb41 anion

Gas phase ion energetics data

Data compiled by: John E. Bartmess

Electron affinity of neutral species

EAneutral (eV) Method Reference Comment
2.84 ± 0.25LPESLuder and MeiwesBroer, 1998EA given is Vertical Detachment Energy (set as 10% of max)

References

Luder and MeiwesBroer, 1998
Luder, C.; MeiwesBroer, K.H., Electron detachment energies of Pb-N(-) (N = 24-204) determined in a simple magnetic bottle photoelectron spectrometer, Chem. Phys. Lett., 1998, 294, 4-5, 391-396, https://doi.org/10.1016/S0009-2614(98)00895-1 . [all data]