(NO)2 radical anion

Gas phase ion energetics data

Data compiled by: John E. Bartmess

Electron affinity of neutral species

EAneutral (eV) Method Reference Comment
2.930 ± 0.050LPESTsukuda, Saeki, et al., 1998Stated electron affinity is the Vertical Detachment Energy
<1.17998LPESPosey and Johnson, 1988EA is onset of dissocation and electron detachment; upper limit

Gas phase thermochemistry data

Data compiled by: John E. Bartmess

Quantity Value Units Method Reference Comment
Δfgas3.7 ± 1.2kcal/molTherLi and Continetti, 2002

References

Tsukuda, Saeki, et al., 1998
Tsukuda, T.; Saeki, M.; Zhu, L.; Nagata, T., Formation of N3O3- anion in (NO)(n)(-): photoelectron spectroscopy and ab initio calculations, Chem. Phys. Lett., 1998, 295, 5-6, 416-422, https://doi.org/10.1016/S0009-2614(98)01002-1 . [all data]

Posey and Johnson, 1988
Posey, L.A.; Johnson, M.A., Pulsed Photoelectron Spectroscopy of Negative Cluster Ions: Isolation of Three Distinguishable Forms of N2O2-, J. Chem. Phys., 1988, 88, 9, 5385, https://doi.org/10.1063/1.454576 . [all data]