(CS2)6 radical anion

Gas phase ion energetics data

Data compiled by: John E. Bartmess

Electron affinity of neutral species

EAneutral (eV) Method Reference Comment
2.230 ± 0.020LPESTsukuda, Hirose, et al., 1997EA given is Vertical Detachment Energy. Affinity is difference from next lower Vertical De

References

Tsukuda, Hirose, et al., 1997
Tsukuda, T.; Hirose, T.; Nagata, T., Negative-ion photoelectron spectroscopy of (CS2)(n)(-): coexistence of electronic isomers, Chem. Phys. Lett., 1997, 279, 3-4, 179-184, https://doi.org/10.1016/S0009-2614(97)01021-X . [all data]