(CS2)2 radical anion

Gas phase thermochemistry data

Data compiled by: John E. Bartmess

Quantity Value Units Method Reference Comment
Δfgas34.2 ± 2.8kcal/molTherHiraoka, Fujimaki, et al., 1994

References

Hiraoka, Fujimaki, et al., 1994
Hiraoka, K.; Fujimaki, S.; Aruga, K., Frontier-controlled Structures of the Gas Phas Clusters A+/-(CS2)n, A+/- = S2+, CS2+, S2-, and CS2-, J. Phys. Chem. (1994), 1994, 98, 7, 1802-1809, https://doi.org/10.1021/j100058a014 . [all data]