Br2..Br3 anion

Gas phase thermochemistry data

Data compiled by: John E. Bartmess

Quantity Value Units Method Reference Comment
Δfgas-316. ± 10.kJ/molTherNizzi, Pommerening, et al., 1998

References

Nizzi, Pommerening, et al., 1998
Nizzi, K.E.; Pommerening, C.A.; Sunderlin, L.S., Gas-phase thermochemistry of polyhalide anions, J. Phys. Chem. A, 1998, 102, 39, 7674-7679, https://doi.org/10.1021/jp9824508 . [all data]