1,2,3,4-tetrafluorophenide anion

Reaction thermochemistry data

Data compiled by: John E. Bartmess

Individual Reactions

C6HF4- + Hydrogen cation = Benzene, 1,2,3,4-tetrafluoro-

By formula: C6HF4- + H+ = C6H2F4

Quantity Value Units Method Reference Comment
Δr1547. ± 8.8kJ/molG+TSBuker, Nibbering, et al., 1997gas phase
Quantity Value Units Method Reference Comment
Δr1513. ± 8.4kJ/molIMREBuker, Nibbering, et al., 1997gas phase

Gas phase ion energetics data

Data compiled by: John E. Bartmess

Protonation reactions

C6HF4- + Hydrogen cation = Benzene, 1,2,3,4-tetrafluoro-

By formula: C6HF4- + H+ = C6H2F4

Quantity Value Units Method Reference Comment
Δr1547. ± 8.8kJ/molG+TSBuker, Nibbering, et al., 1997gas phase
Quantity Value Units Method Reference Comment
Δr1513. ± 8.4kJ/molIMREBuker, Nibbering, et al., 1997gas phase

References

Buker, Nibbering, et al., 1997
Buker, H.H.; Nibbering, N.M.M.; Espinosa, D.; Mongin, F.; Schlosser, M., Additivity of substituent effects in the fluoroarene series: Equilibrium acidity in the gas phase and deprotonation rates in ethereal solution, Tetrahed. Lett., 1997, 38, 49, 8519-8522, https://doi.org/10.1016/S0040-4039(97)10303-3 . [all data]