iPrBr..Cl anion

Gas phase thermochemistry data

Data compiled by: John E. Bartmess

Quantity Value Units Method Reference Comment
Δfgas-386.5kJ/molTherLi, Ross, et al., 1996

References

Li, Ross, et al., 1996
Li, C.; Ross, P.; Szulejko, J.; McMahon, T.B., High-Pressure Mass Spectrometric Investigations of the Potential Energy Surfaces of Gas-Phase Sn2 Reactions., J. Am. Chem. Soc., 1996, 118, 39, 9360, https://doi.org/10.1021/ja960565o . [all data]