CH2=C(OiPr)O anion

Gas phase ion energetics data

Data compiled by: John E. Bartmess

Electron affinity of neutral species

EAneutral (eV) Method Reference Comment
1.72 ± 0.20D-EAHaas, Giblin, et al., 1998From transesterification equilibria

Protonation reactions

C5H9O2- + Hydrogen cation = Isopropyl acetate

By formula: C5H9O2- + H+ = C5H10O2

Quantity Value Units Method Reference Comment
Δr371.9 ± 4.1kcal/molG+TSHaas, Giblin, et al., 1998gas phase; From transesterification equilibria
Quantity Value Units Method Reference Comment
Δr365.2 ± 4.0kcal/molIMREHaas, Giblin, et al., 1998gas phase; From transesterification equilibria

References

Haas, Giblin, et al., 1998
Haas, G.W.; Giblin, D.E.; Gross, M.L., The Mechanism and Thermodynamics of Transesterification of Acetate-Ester Enolates in the Gas Phase, Int. J. Mass Spectrom. Ion Proc., 1998, 172, 1-2, 25, https://doi.org/10.1016/S0168-1176(97)83245-4 . [all data]