CH2=C(OnPr)O anion

Reaction thermochemistry data

Data compiled by: John E. Bartmess

Individual Reactions

C5H9O2- + Hydrogen cation = n-Propyl acetate

By formula: C5H9O2- + H+ = C5H10O2

Quantity Value Units Method Reference Comment
Δr1554. ± 17.kJ/molG+TSHaas, Giblin, et al., 1998gas phase; From transesterification equilibria
Quantity Value Units Method Reference Comment
Δr1525. ± 17.kJ/molIMREHaas, Giblin, et al., 1998gas phase; From transesterification equilibria

Gas phase ion energetics data

Data compiled by: John E. Bartmess

Electron affinity of neutral species

EAneutral (eV) Method Reference Comment
1.75 ± 0.20D-EAHaas, Giblin, et al., 1998From transesterification equilibria

Protonation reactions

C5H9O2- + Hydrogen cation = n-Propyl acetate

By formula: C5H9O2- + H+ = C5H10O2

Quantity Value Units Method Reference Comment
Δr1554. ± 17.kJ/molG+TSHaas, Giblin, et al., 1998gas phase; From transesterification equilibria
Quantity Value Units Method Reference Comment
Δr1525. ± 17.kJ/molIMREHaas, Giblin, et al., 1998gas phase; From transesterification equilibria

References

Haas, Giblin, et al., 1998
Haas, G.W.; Giblin, D.E.; Gross, M.L., The Mechanism and Thermodynamics of Transesterification of Acetate-Ester Enolates in the Gas Phase, Int. J. Mass Spectrom. Ion Proc., 1998, 172, 1-2, 25, https://doi.org/10.1016/S0168-1176(97)83245-4 . [all data]