CO..Pt6 radical anion

Reaction thermochemistry data

Data compiled by: John E. Bartmess

Individual Reactions

CAS Reg. No. 151247-66-4 + Carbon monoxide = COPt6-

By formula: CAS Reg. No. 151247-66-4 + CO = COPt6-

Quantity Value Units Method Reference Comment
Δr53.0 ± 6.9kcal/molN/AGrushow and Ervin, 1997gas phase

References

Grushow and Ervin, 1997
Grushow, A.; Ervin, K.M., Ligand and Metal Binding Energies in Platinum Carbonyl Cluster Anions: Collision Induced Dissociation of PtM- and Ptm(CO)n-, J. Chem. Phys., 1997, 106, 23, 9580, https://doi.org/10.1063/1.474116 . [all data]