Biphenyl anion

Gas phase thermochemistry data

Data compiled by: John E. Bartmess

Quantity Value Units Method Reference Comment
Δfgas>168. ± 4.6kJ/molR-EAWojnarovits and Foldiak, 1981EA is an upper limit: Chen and Wentworth, 1989. G3MP2B3 calculations indicate an EA of ca. -0.02 eV, anion unbound.

References

Wojnarovits and Foldiak, 1981
Wojnarovits, L.; Foldiak, G., Electron capture detection of aromatic hydrocarbons, J. Chromatogr. Sci., 1981, 206, 511. [all data]

Chen and Wentworth, 1989
Chen, E.C.M.; Wentworth, W.E., Experimental Determination of Electron Affinities of Organic Molecules, Mol. Cryst. Liq. Cryst., 1989, 171, 271. [all data]