(MeCN)25..Br anion

Gas phase ion energetics data

Data compiled by: John E. Bartmess

Electron affinity of neutral species

EAneutral (eV) Method Reference Comment
6.514 ± 0.072LPESMarkovich, Perera, et al., 1996

References

Markovich, Perera, et al., 1996
Markovich, G.; Perera, L.; Berkowitz, M.L.; Cheshnovsky, O., The Solvation of Cl-, Br-, and I- in Acetonitrile Cluster: Photoelectron Spectroscopy and Molecular Dynamics Simulations., J. Chem. Phys., 1996, 105, 7, 2675, https://doi.org/10.1063/1.472131 . [all data]