(MeCN)10..Cl anion

Gas phase thermochemistry data

Data compiled by: John E. Bartmess

Quantity Value Units Method Reference Comment
Δfgas30.87kcal/molTherMarkovich, Perera, et al., 1996

Gas phase ion energetics data

Data compiled by: John E. Bartmess

Electron affinity of neutral species

EAneutral (eV) Method Reference Comment
6.843 ± 0.033LPESMarkovich, Perera, et al., 1996

References

Markovich, Perera, et al., 1996
Markovich, G.; Perera, L.; Berkowitz, M.L.; Cheshnovsky, O., The Solvation of Cl-, Br-, and I- in Acetonitrile Cluster: Photoelectron Spectroscopy and Molecular Dynamics Simulations., J. Chem. Phys., 1996, 105, 7, 2675, https://doi.org/10.1063/1.472131 . [all data]