2,3,6-trimethyl-p-benzoquinone anion

Gas phase thermochemistry data

Data compiled by: John E. Bartmess

Quantity Value Units Method Reference Comment
Δfgas-90.9 ± 2.3kcal/molR-EAFukuda and McIver, 1985ΔGea(355 K) = -37.7 kcal/mol; ΔSea =-3.3, est. from data in Heinis, Chowdhury, et al., 1988

References

Fukuda and McIver, 1985
Fukuda, E.K.; McIver, R.T., Jr., Relative electron affinities of substituted benzophenones, nitrobenzenes, and quinones. [Anchored to EA(SO2) from 74CEL/BEN], J. Am. Chem. Soc., 1985, 107, 2291. [all data]

Heinis, Chowdhury, et al., 1988
Heinis, T.; Chowdhury, S.; Scott, S.L.; Kebarle, P., Electron Affinities of Benzo-, Naphtho-, and Anthraquinones Determined from Gas-Phase Equilibria Measurements, J. Am. Chem. Soc., 1988, 110, 2, 400, https://doi.org/10.1021/ja00210a015 . [all data]