Si9F radical anion

Gas phase ion energetics data

Data compiled by: John E. Bartmess

Electron affinity of neutral species

EAneutral (eV) Method Reference Comment
3.33 ± 0.15LPESKawamata, Neigishi, et al., 1996

References

Kawamata, Neigishi, et al., 1996
Kawamata, H.; Neigishi, Y.; Kishi, R.; Iwata, S.; Nakajima, A.; Kaya, K., Photoelectron Spectroscopy of Silicon-Fluorine Binary Cluster Anions (SinFm-), J. Chem. Phys., 1996, 105, 13, 5369, https://doi.org/10.1063/1.472377 . [all data]