SiF2 radical anion

Gas phase thermochemistry data

Data compiled by: John E. Bartmess

Quantity Value Units Method Reference Comment
Δfgas-144.0 ± 5.3kcal/molR-EAKawamata, Neigishi, et al., 1996Vertical Detachment Energy: 0.68±0.02 eV

References

Kawamata, Neigishi, et al., 1996
Kawamata, H.; Neigishi, Y.; Kishi, R.; Iwata, S.; Nakajima, A.; Kaya, K., Photoelectron Spectroscopy of Silicon-Fluorine Binary Cluster Anions (SinFm-), J. Chem. Phys., 1996, 105, 13, 5369, https://doi.org/10.1063/1.472377 . [all data]