2,3,6-triMe-benzoate anion

Gas phase ion energetics data

Data compiled by: John E. Bartmess

Protonation reactions

C10H11O2- + Hydrogen cation = 2,3,6-Trimethylbenzoic acid

By formula: C10H11O2- + H+ = C10H12O2

Quantity Value Units Method Reference Comment
Δr1384. ± 8.8kJ/molIMREDecouzon, Gal, et al., 1997gas phase

Reaction thermochemistry data

Data compiled by: John E. Bartmess

Individual Reactions

C10H11O2- + Hydrogen cation = 2,3,6-Trimethylbenzoic acid

By formula: C10H11O2- + H+ = C10H12O2

Quantity Value Units Method Reference Comment
Δr1384. ± 8.8kJ/molIMREDecouzon, Gal, et al., 1997gas phase

References

Decouzon, Gal, et al., 1997
Decouzon, M.; Gal, J.-F.; Maria, P.-C.; Bohm, S.; Jimenez, P.; Roux, M.V.; Exner, O., Steric Effects in Crowded Molecules in the Gas Phase: Polymethyl Substituted Benzoic Acids, New J. Chem., 1997, 21, 561. [all data]