Phthalic anhydride anion

Gas phase thermochemistry data

Data compiled by: John E. Bartmess

Quantity Value Units Method Reference Comment
Δfgas-491.6 ± 8.8kJ/molR-EAPaul and Kebarle, 1989ΔGea(423 K) = -27.4±1 kcal/mol, ΔS = 3±3 eu

References

Paul and Kebarle, 1989
Paul, G.; Kebarle, P., Electron Affinities of Cyclic Unsaturated Dicarbonyls: Maleic Anhydrides, Maleimides, and Cyclopentendione, J. Am. Chem. Soc., 1989, 111, 2, 464, https://doi.org/10.1021/ja00184a009 . [all data]