Si11Na radical anion

Gas phase ion energetics data

Data compiled by: John E. Bartmess

Electron affinity of neutral species

EAneutral (eV) Method Reference Comment
2.59 ± 0.25LPESKishi, Kawamata, et al., 1997Vertical Detachment Energy: 2.21±.08 eV

References

Kishi, Kawamata, et al., 1997
Kishi, R.; Kawamata, H.; Neigishi, Y.; Iwata, S.; Nakajima, A.; Kaya, K., Geometric and Electronic Structures of Silicon-Sodium Binary Clusters. II. Photoelectron Spectroscopy of SinNam Cluster Anions, J. Chem. Phys., 1997, 107, 23, 10029, https://doi.org/10.1063/1.474160 . [all data]