YbCl3..Cl anion

Gas phase ion energetics data

Data compiled by: John E. Bartmess

Electron affinity of neutral species

EAneutral (eV) Method Reference Comment
4.4 ± 1.3R-AKuznetsov, Kudin, et al., 1997value altered from reference due to conversion from electron convention to ion convention

Gas phase thermochemistry data

Data compiled by: John E. Bartmess

Quantity Value Units Method Reference Comment
Δfgas-288.05kcal/molTherKuznetsov, Kudin, et al., 1997value altered from reference due to conversion from electron convention to ion convention
Δfgas-297.5 ± 4.5kcal/molTherKudin, Vorob'ev, et al., 2007value altered from reference due to conversion from electron convention to ion convention

References

Kuznetsov, Kudin, et al., 1997
Kuznetsov, A.Yu.; Kudin, L.S.; Pogrebnoi, A.M.; Butman, M.F.; Burdukovskaya, G.G., A Mass-spectrometric Study of the Neutral and Ionic Components of Ytterbium Chloride Vapor: The Enthalpies of Formation of YbCl2 and YbCl3 Molecules and YbCl3- and YbCl4- Ion in the Gas Phas, Russ. J. Phys. Chem., 1997, 71, 216. [all data]