Fe8S3 radical anion

Gas phase ion energetics data

Data compiled by: John E. Bartmess

Electron affinity of neutral species

EAneutral (eV) Method Reference Comment
2.020 ± 0.080LPESNakajima, Hayase, et al., 1997Vertical Detachment Energy: 2.79±.35 eV

References

Nakajima, Hayase, et al., 1997
Nakajima, A.; Hayase, T.; Hayakawa, F.; Kaya, K., Study on Iron-Sulfur Cluster in the Gas-phase: Electronic Structure and Reactivity, Chem. Phys. Lett., 1997, 280, 3-4, 381, https://doi.org/10.1016/S0009-2614(97)01162-7 . [all data]