HCðCAsH anion

Gas phase ion energetics data

Data compiled by: John E. Bartmess

Protonation reactions

C2H2As- + Hydrogen cation = C2H3As

By formula: C2H2As- + H+ = C2H3As

Quantity Value Units Method Reference Comment
Δr1466. ± 9.2kJ/molG+TSGuillemin, Decouzon, et al., 1997gas phase
Quantity Value Units Method Reference Comment
Δr1434. ± 8.8kJ/molIMREGuillemin, Decouzon, et al., 1997gas phase

References

Guillemin, Decouzon, et al., 1997
Guillemin, J.C.; Decouzon, M.; Maria, P.C.; Gal, J.F.; Mo, O.; Yanez, M., Gas-phase basicities and acidities of ethyl-, vinyl, and ethynylarsine. An experimental and theoretical study, J. Phys. Chem. A, 1997, 101, 9525. [all data]