molybdenum oxide anion

Gas phase thermochemistry data

Data compiled by: John E. Bartmess

Quantity Value Units Method Reference Comment
Δfgas298. ± 8.4kJ/molR-EAGunion, Dixon-Warren, et al., 1996

References

Gunion, Dixon-Warren, et al., 1996
Gunion, R.F.; Dixon-Warren, J.; Lineberger, W.C.; Morse, M.D., Ultraviolet Photoelectron Spectroscopy of Molybdenum and Molybdenum Monoxide Anions, J. Chem. Phys., 1996, 104, 5, 1765, https://doi.org/10.1063/1.470975 . [all data]