AgNi2 anion

Gas phase ion energetics data

Data compiled by: John E. Bartmess

Electron affinity of neutral species

EAneutral (eV) Method Reference Comment
2.390 ± 0.010LPESDixon-Warren, Gunion, et al., 1996Stated electron affinity is the Vertical Detachment Energy

References

Dixon-Warren, Gunion, et al., 1996
Dixon-Warren, St.J.; Gunion, R.F.; Lineberger, W.C., Photoelectron Spectroscopy of Mixed Metal Cluster Anions: NiCu-, NiAg-, NiAg2-, and Ni2Ag-, J. Chem. Phys., 1996, 104, 13, 4902, https://doi.org/10.1063/1.471123 . [all data]