(H2O)3..adenosine-5'-O2POPO2(OH) dianion

Ion clustering data

Data compiled by: John E. Bartmess

Clustering reactions

C10H19N5O13P2-2 + 4Water = C10H21N5O14P2-2

By formula: C10H19N5O13P2-2 + 4H2O = C10H21N5O14P2-2

Quantity Value Units Method Reference Comment
Δr25.5 ± 0.84kJ/molIMREBlades, Ho, et al., 1996gas phase; Correction to published article: P. Kebarle

References

Blades, Ho, et al., 1996
Blades, A.T.; Ho, Y.; Kebarle, P., Free Energies of Hydration in the Gas Phase of Some Phosphate Singly and Doubly Charged Anions: orthophosphate, diphosphate, Ribose-5-phosphate, Adenosine-5'-phosphate and Adenosine-5'-Dipho, J. Phys. Chem., 1996, 100, 6, 2443, https://doi.org/10.1021/jp952032s . [all data]